Reaction Details
TargetEndochitinase A1
LigandBDBM50331835
Substrate/Competitorn/a
Meas. Tech.ChEMBL_686888 (CHEMBL1291257)
IC50>1000000±n/a nM
Citation Schüttelkopf, AWGros, LBlair, DEFrearson, JAvan Aalten, DMGilbert, IH Acetazolamide-based fungal chitinase inhibitors. Bioorg Med Chem18:8334-40 (2010) 
 
Endochitinase A1
Name:Endochitinase A1
Type:Enzyme
Mol. Mass.:83057.83
Organism:Neosartorya fumigata (Aspergillus fumigatus)
Description:Q873Y0
Residue:825
BDBM50331835
NameBDBM50331835
Synonyms:5-(2-methyl-propylamido)-2-sulfamoyl-1,3,4-thiadiazole | CHEMBL1288807
TypeSmall organic molecule
Emp. Form.C6H10N4O3S2
Mol. Mass.250.299
SMILESCC(C)C(=O)Nc1nnc(s1)S(N)(=O)=O