Reaction Details
TargetEndochitinase A1
LigandBDBM50331847
Substrate/Competitorn/a
Meas. Tech.ChEMBL_686888 (CHEMBL1291257)
IC50>1000000±n/a nM
Citation Schüttelkopf, AWGros, LBlair, DEFrearson, JAvan Aalten, DMGilbert, IH Acetazolamide-based fungal chitinase inhibitors. Bioorg Med Chem18:8334-40 (2010) 
 
Endochitinase A1
Name:Endochitinase A1
Type:Enzyme
Mol. Mass.:83057.83
Organism:Neosartorya fumigata (Aspergillus fumigatus)
Description:Q873Y0
Residue:825
BDBM50331847
NameBDBM50331847
Synonyms:5-Amino-2-methyl-1,3,4-thiadiazole | CHEMBL1288960
TypeSmall organic molecule
Emp. Form.C3H5N3S
Mol. Mass.115.157
SMILESCc1nnc(N)s1