Reaction Details
TargetEndochitinase A1
LigandBDBM50331848
Substrate/Competitorn/a
Meas. Tech.ChEMBL_686888 (CHEMBL1291257)
IC50>1000000±n/a nM
Citation Schüttelkopf, AWGros, LBlair, DEFrearson, JAvan Aalten, DMGilbert, IH Acetazolamide-based fungal chitinase inhibitors. Bioorg Med Chem18:8334-40 (2010) 
 
Endochitinase A1
Name:Endochitinase A1
Type:Enzyme
Mol. Mass.:83057.83
Organism:Neosartorya fumigata (Aspergillus fumigatus)
Description:Q873Y0
Residue:825
BDBM50331848
NameBDBM50331848
Synonyms:2-chloro-N-(5-isobutyl-1,3,4-thiadiazol-2-yl)acetamide | CHEMBL1288961
TypeSmall organic molecule
Emp. Form.C8H12ClN3OS
Mol. Mass.233.718
SMILESCC(C)Cc1nnc(NC(=O)CCl)s1