Reaction Details
TargetAdenosine receptor A2b
LigandBDBM50331911
Substrate/Competitorn/a
Meas. Tech.ChEMBL_687324 (CHEMBL1292000)
Ki 28±n/a nM
Citation McGuinness, BFHo, KKStauffer, TMRokosz, LLMannava, NKultgen, SGSaionz, KKlon, AChen, WDesai, HRogers, WLWebb, MYin, JJiang, YLi, TYan, HJing, KZhang, SMajumdar, KKSrivastava, VSaha, S Discovery of novel quinolinone adenosine A2B antagonists. Bioorg Med Chem Lett20:7414-20 (2010) 
 
Adenosine receptor A2b
Name:Adenosine receptor A2b
Type:G Protein-Coupled Receptor (GPCR)
Mol. Mass.:36341.22
Organism:Homo sapiens (Human)
Description:n/a
Residue:332
BDBM50331911
NameBDBM50331911
Synonyms:(S)-2-(2-oxo-4-phenethyl-3-(thiazol-2-yl)-1,2-dihydroquinolin-6-yloxy)-N-(1-phenylethyl)acetamide | CHEMBL1290210
TypeSmall organic molecule
Emp. Form.C30H27N3O3S
Mol. Mass.509.619
SMILESC[C@H](NC(=O)COc1ccc2[nH]c(=O)c(-c3nccs3)c(CCc3ccccc3)c2c1)c1ccccc1