Reaction Details
TargetAdenosine receptor A1
LigandBDBM50331916
Substrate/Competitorn/a
Meas. Tech.ChEMBL_687326 (CHEMBL1292002)
Ki 8.6±n/a nM
Citation McGuinness, BFHo, KKStauffer, TMRokosz, LLMannava, NKultgen, SGSaionz, KKlon, AChen, WDesai, HRogers, WLWebb, MYin, JJiang, YLi, TYan, HJing, KZhang, SMajumdar, KKSrivastava, VSaha, S Discovery of novel quinolinone adenosine A2B antagonists. Bioorg Med Chem Lett20:7414-20 (2010) 
 
Adenosine receptor A1
Name:Adenosine receptor A1
Type:G Protein-Coupled Receptor (GPCR)
Mol. Mass.:36520.92
Organism:Homo sapiens (Human)
Description:P30542
Residue:326
BDBM50331916
NameBDBM50331916
Synonyms:(S)-2-(2-oxo-4-phenethyl-3-(thiazol-2-yl)-1,2-dihydroquinolin-6-yloxy)-N-(1-phenylpropyl)acetamide | CHEMBL1289569
TypeSmall organic molecule
Emp. Form.C31H29N3O3S
Mol. Mass.523.645
SMILESCC[C@H](NC(=O)COc1ccc2[nH]c(=O)c(-c3nccs3)c(CCc3ccccc3)c2c1)c1ccccc1