Reaction Details
TargetExtracellular calcium-sensing receptor
LigandBDBM50331947
Substrate/Competitorn/a
Meas. Tech.ChEMBL_687401 (CHEMBL1292077)
IC50 97±n/a nM
Citation Yoshida, MMori, AInaba, AOka, MMakino, HYamaguchi, MFujita, HKawamoto, TGoto, MKimura, HBaba, AYasuma, T Synthesis and structure-activity relationship of tetrahydropyrazolopyrimidine derivatives--a novel structural class of potent calcium-sensing receptor antagonists. Bioorg Med Chem18:8501-11 (2010) 
 
Extracellular calcium-sensing receptor
Name:Extracellular calcium-sensing receptor
Type:Protein
Mol. Mass.:120663.13
Organism:Homo sapiens (Human)
Description:P41180
Residue:1078
BDBM50331947
NameBDBM50331947
Synonyms:1-Adamantyl-5-phenyl-7-(trifluoromethyl)-4,5,6,7-tetrahydropyrazolo-[1,5-a]-pyrimidine-3-carboxylate | CHEMBL1289346
TypeSmall organic molecule
Emp. Form.C24H26F3N3O2
Mol. Mass.445.4773
SMILESFC(F)(F)[C@H]1C[C@H](Nc2c(cnn12)C(=O)OC12CC3CC(CC(C3)C1)C2)c1ccccc1