Reaction Details
TargetExtracellular calcium-sensing receptor
LigandBDBM50331948
Substrate/Competitorn/a
Meas. Tech.ChEMBL_687401 (CHEMBL1292077)
IC50>10000±n/a nM
Citation Yoshida, MMori, AInaba, AOka, MMakino, HYamaguchi, MFujita, HKawamoto, TGoto, MKimura, HBaba, AYasuma, T Synthesis and structure-activity relationship of tetrahydropyrazolopyrimidine derivatives--a novel structural class of potent calcium-sensing receptor antagonists. Bioorg Med Chem18:8501-11 (2010) 
 
Extracellular calcium-sensing receptor
Name:Extracellular calcium-sensing receptor
Type:Protein
Mol. Mass.:120663.13
Organism:Homo sapiens (Human)
Description:P41180
Residue:1078
BDBM50331948
NameBDBM50331948
Synonyms:CHEMBL1289463 | N-(1-Adamantyl)-4-methyl-7-trifluoromethyl-4,5,6,7-tetrahydropyrazolo-[1,5-a]pyrimidine-3-carboxamide
TypeSmall organic molecule
Emp. Form.C25H29F3N4O
Mol. Mass.458.5192
SMILESCN1[C@@H](C[C@@H](n2ncc(C(=O)NC34CC5CC(CC(C5)C3)C4)c12)C(F)(F)F)c1ccccc1