Reaction Details
TargetExtracellular calcium-sensing receptor
LigandBDBM50331949
Substrate/Competitorn/a
Meas. Tech.ChEMBL_687401 (CHEMBL1292077)
IC50>10000±n/a nM
Citation Yoshida, MMori, AInaba, AOka, MMakino, HYamaguchi, MFujita, HKawamoto, TGoto, MKimura, HBaba, AYasuma, T Synthesis and structure-activity relationship of tetrahydropyrazolopyrimidine derivatives--a novel structural class of potent calcium-sensing receptor antagonists. Bioorg Med Chem18:8501-11 (2010) 
 
Extracellular calcium-sensing receptor
Name:Extracellular calcium-sensing receptor
Type:Protein
Mol. Mass.:120663.13
Organism:Homo sapiens (Human)
Description:P41180
Residue:1078
BDBM50331949
NameBDBM50331949
Synonyms:CHEMBL1289464 | N-[5-Phenyl-7-(trifluoromethyl)-4,5,6,7-tetrahydropyrazolo[1,5-a]pyrimidi-ne-3-yl]-adamantane-1-carboxamide
TypeSmall organic molecule
Emp. Form.C24H27F3N4O
Mol. Mass.444.4926
SMILESFC(F)(F)[C@H]1C[C@H](Nc2c(NC(=O)C34CC5CC(CC(C5)C3)C4)cnn12)c1ccccc1