Reaction Details
TargetExtracellular calcium-sensing receptor
LigandBDBM50331958
Substrate/Competitorn/a
Meas. Tech.ChEMBL_687401 (CHEMBL1292077)
IC50>10000±n/a nM
Citation Yoshida, MMori, AInaba, AOka, MMakino, HYamaguchi, MFujita, HKawamoto, TGoto, MKimura, HBaba, AYasuma, T Synthesis and structure-activity relationship of tetrahydropyrazolopyrimidine derivatives--a novel structural class of potent calcium-sensing receptor antagonists. Bioorg Med Chem18:8501-11 (2010) 
 
Extracellular calcium-sensing receptor
Name:Extracellular calcium-sensing receptor
Type:Protein
Mol. Mass.:120663.13
Organism:Homo sapiens (Human)
Description:P41180
Residue:1078
BDBM50331958
NameBDBM50331958
Synonyms:CHEMBL1290006 | N-(1-Adamantyl)-5-tert-butyl-7-(trifluoromethyl)-4,5,6,7-tetrahydropyrazo-lo-[1,5-a]pyrimidine-3-carboxamide
TypeSmall organic molecule
Emp. Form.C22H31F3N4O
Mol. Mass.424.5029
SMILESCC(C)(C)[C@@H]1C[C@@H](n2ncc(C(=O)NC34CC5CC(CC(C5)C3)C4)c2N1)C(F)(F)F