Reaction Details
TargetCarbonic anhydrase 2
LigandBDBM50332023
Substrate/Competitorn/a
Meas. Tech.ChEMBL_687566 (CHEMBL1290838)
Ki>100000±n/a nM
Citation Maresca, AScozzafava, ASupuran, CT 7,8-disubstituted- but not 6,7-disubstituted coumarins selectively inhibit the transmembrane, tumor-associated carbonic anhydrase isoforms IX and XII over the cytosolic ones I and II in the low nanomolar/subnanomolar range. Bioorg Med Chem Lett20:7255-8 (2010) 
 
Carbonic anhydrase 2
Name:Carbonic anhydrase 2
Type:Enzyme
Mol. Mass.:29250.71
Organism:Homo sapiens (Human)
Description:P00918
Residue:260
BDBM50332023
NameBDBM50332023
Synonyms:6-Acetyl-7-(2-adamantan-1-yl-ethoxy)-chromen-2-one | CHEMBL1290110
TypeSmall organic molecule
Emp. Form.C23H26O4
Mol. Mass.366.4501
SMILESCC(=O)c1cc2ccc(=O)oc2cc1OCCC12CC3CC(CC(C3)C1)C2