Reaction Details
TargetCarbonic anhydrase 1
LigandBDBM50174558
Substrate/Competitorn/a
Meas. Tech.ChEMBL_687565 (CHEMBL1290837)
Ki 58400±n/a nM
Citation Maresca, AScozzafava, ASupuran, CT 7,8-disubstituted- but not 6,7-disubstituted coumarins selectively inhibit the transmembrane, tumor-associated carbonic anhydrase isoforms IX and XII over the cytosolic ones I and II in the low nanomolar/subnanomolar range. Bioorg Med Chem Lett20:7255-8 (2010) 
 
Carbonic anhydrase 1
Name:Carbonic anhydrase 1
Type:Enzyme
Mol. Mass.:28873.37
Organism:Homo sapiens (Human)
Description:P00915
Residue:261
BDBM50174558
NameBDBM50174558
Synonyms:7-hydroxy-2H-1-benzopyran-2-one CHEMBL51628 beta-umbelliferone skimmetin | umbelliferone
TypeSmall organic molecule
Emp. Form.C9H6O3
Mol. Mass.162.1421
SMILESOc1ccc2ccc(=O)oc2c1