Reaction Details
TargetCarbonic anhydrase 9
LigandBDBM50332029
Substrate/Competitorn/a
Meas. Tech.ChEMBL_687567 (CHEMBL1290839)
Ki 63.9±n/a nM
Citation Maresca, AScozzafava, ASupuran, CT 7,8-disubstituted- but not 6,7-disubstituted coumarins selectively inhibit the transmembrane, tumor-associated carbonic anhydrase isoforms IX and XII over the cytosolic ones I and II in the low nanomolar/subnanomolar range. Bioorg Med Chem Lett20:7255-8 (2010) 
 
Carbonic anhydrase 9
Name:Carbonic anhydrase 9
Type:Enzyme
Mol. Mass.:49669.03
Organism:Homo sapiens (Human)
Description:Catalytic domain of human cloned isozyme was used in the assay
Residue:459
BDBM50332029
NameBDBM50332029
Synonyms:8-Acetyl-7-(2-adamantan-1-yl-ethoxy)-chromen-2-one | CHEMBL1290219
TypeSmall organic molecule
Emp. Form.C23H26O4
Mol. Mass.366.4501
SMILESCC(=O)c1c(OCCC23CC4CC(CC(C4)C2)C3)ccc2ccc(=O)oc12