Reaction Details
TargetZn finger protein
LigandBDBM50332023
Substrate/Competitorn/a
Meas. Tech.ChEMBL_687568 (CHEMBL1290840)
Ki 77700±n/a nM
Citation Maresca, AScozzafava, ASupuran, CT 7,8-disubstituted- but not 6,7-disubstituted coumarins selectively inhibit the transmembrane, tumor-associated carbonic anhydrase isoforms IX and XII over the cytosolic ones I and II in the low nanomolar/subnanomolar range. Bioorg Med Chem Lett20:7255-8 (2010) 
 
Zn finger protein
Name:Zn finger protein
Synonyms:n/a
Type:PROTEIN
Mol. Mass.:25827.13
Organism:Nicotiana tabacum
Description:ChEMBL_687568
Residue:234
BDBM50332023
NameBDBM50332023
TypeSmall organic molecule
Emp. Form.C23H26O4
Mol. Mass.366.4501
SMILESCC(=O)c1cc2ccc(=O)oc2cc1OCCC12CC3CC(CC(C3)C1)C2