Reaction Details
TargetMitogen-activated protein kinase 8
LigandBDBM50332049
Substrate/Competitorn/a
Meas. Tech.ChEMBL_687739 (CHEMBL1291185)
IC50 7000±n/a nM
Citation Hom, RKBowers, SSealy, JMTruong, APProbst, GDNeitzel, MLNeitz, RJFang, LBrogley, LWu, JKonradi, AWSham, HLTóth, GPan, HYao, NArtis, DRQuinn, KSauer, JMPowell, KRen, ZBard, FYednock, TAGriswold-Prenner, I Design and synthesis of disubstituted thiophene and thiazole based inhibitors of JNK. Bioorg Med Chem Lett20:7303-7 (2010) 
 
Mitogen-activated protein kinase 8
Name:Mitogen-activated protein kinase 8
Type:Enzyme
Mol. Mass.:48297.57
Organism:Homo sapiens (Human)
Description:JNK-1 was purchased from Upstate Cell Signaling Solutions (formerly Upstate Biotechnology).
Residue:427
BDBM50332049
NameBDBM50332049
Synonyms:CHEMBL1288214 | methyl 3-(2-(2-(1H-1,2,3-triazol-4-yl)phenyl)acetamido)thiophene-2-carboxylate
TypeSmall organic molecule
Emp. Form.C16H14N4O3S
Mol. Mass.342.372
SMILESCOC(=O)c1sccc1NC(=O)Cc1ccccc1-c1c[nH]nn1