Reaction Details
TargetMitogen-activated protein kinase 8
LigandBDBM50332054
Substrate/Competitorn/a
Meas. Tech.ChEMBL_687739 (CHEMBL1291185)
IC50 500±n/a nM
Citation Hom, RKBowers, SSealy, JMTruong, APProbst, GDNeitzel, MLNeitz, RJFang, LBrogley, LWu, JKonradi, AWSham, HLTóth, GPan, HYao, NArtis, DRQuinn, KSauer, JMPowell, KRen, ZBard, FYednock, TAGriswold-Prenner, I Design and synthesis of disubstituted thiophene and thiazole based inhibitors of JNK. Bioorg Med Chem Lett20:7303-7 (2010) 
 
Mitogen-activated protein kinase 8
Name:Mitogen-activated protein kinase 8
Type:Enzyme
Mol. Mass.:48297.57
Organism:Homo sapiens (Human)
Description:JNK-1 was purchased from Upstate Cell Signaling Solutions (formerly Upstate Biotechnology).
Residue:427
BDBM50332054
NameBDBM50332054
Synonyms:CHEMBL1288243 | isopropyl 3-(2-phenylacetamido)thiophene-2-carboxylate
TypeSmall organic molecule
Emp. Form.C16H17NO3S
Mol. Mass.303.376
SMILESCC(C)OC(=O)c1sccc1NC(=O)Cc1ccccc1