Reaction Details
TargetMitogen-activated protein kinase 8
LigandBDBM50332059
Substrate/Competitorn/a
Meas. Tech.ChEMBL_687739 (CHEMBL1291185)
IC50>50000±n/a nM
Citation Hom, RKBowers, SSealy, JMTruong, APProbst, GDNeitzel, MLNeitz, RJFang, LBrogley, LWu, JKonradi, AWSham, HLTóth, GPan, HYao, NArtis, DRQuinn, KSauer, JMPowell, KRen, ZBard, FYednock, TAGriswold-Prenner, I Design and synthesis of disubstituted thiophene and thiazole based inhibitors of JNK. Bioorg Med Chem Lett20:7303-7 (2010) 
 
Mitogen-activated protein kinase 8
Name:Mitogen-activated protein kinase 8
Type:Enzyme
Mol. Mass.:48297.57
Organism:Homo sapiens (Human)
Description:JNK-1 was purchased from Upstate Cell Signaling Solutions (formerly Upstate Biotechnology).
Residue:427
BDBM50332059
NameBDBM50332059
Synonyms:CHEMBL1288273 | ethyl 3-methyl-5-(2-(naphthalen-1-yl)acetamido)isothiazole-4-carboxylate
TypeSmall organic molecule
Emp. Form.C19H18N2O3S
Mol. Mass.354.423
SMILESCCOC(=O)c1c(C)nsc1NC(=O)Cc1cccc2ccccc12