Reaction Details
TargetMitogen-activated protein kinase 8
LigandBDBM50332073
Substrate/Competitorn/a
Meas. Tech.ChEMBL_687739 (CHEMBL1291185)
IC50 250±n/a nM
Citation Hom, RKBowers, SSealy, JMTruong, APProbst, GDNeitzel, MLNeitz, RJFang, LBrogley, LWu, JKonradi, AWSham, HLTóth, GPan, HYao, NArtis, DRQuinn, KSauer, JMPowell, KRen, ZBard, FYednock, TAGriswold-Prenner, I Design and synthesis of disubstituted thiophene and thiazole based inhibitors of JNK. Bioorg Med Chem Lett20:7303-7 (2010) 
 
Mitogen-activated protein kinase 8
Name:Mitogen-activated protein kinase 8
Type:Enzyme
Mol. Mass.:48297.57
Organism:Homo sapiens (Human)
Description:JNK-1 was purchased from Upstate Cell Signaling Solutions (formerly Upstate Biotechnology).
Residue:427
BDBM50332073
NameBDBM50332073
Synonyms:CHEMBL1287974 | N-(2-(5-methyl-1H-1,2,4-triazol-3-yl)thiophen-3-yl)-2-(naphthalen-1-yl)acetamide
TypeSmall organic molecule
Emp. Form.C19H16N4OS
Mol. Mass.348.422
SMILESCc1nnc([nH]1)-c1sccc1NC(=O)Cc1cccc2ccccc12