Reaction Details
TargetMitogen-activated protein kinase 9
LigandBDBM50332042
Substrate/Competitorn/a
Meas. Tech.ChEMBL_687740 (CHEMBL1291186)
IC50>50000±n/a nM
Citation Hom, RKBowers, SSealy, JMTruong, APProbst, GDNeitzel, MLNeitz, RJFang, LBrogley, LWu, JKonradi, AWSham, HLTóth, GPan, HYao, NArtis, DRQuinn, KSauer, JMPowell, KRen, ZBard, FYednock, TAGriswold-Prenner, I Design and synthesis of disubstituted thiophene and thiazole based inhibitors of JNK. Bioorg Med Chem Lett20:7303-7 (2010) 
 
Mitogen-activated protein kinase 9
Name:Mitogen-activated protein kinase 9
Type:Enzyme
Mol. Mass.:48131.49
Organism:Homo sapiens (Human)
Description:JNK-2 was purchased from Upstate Cell Signaling Solutions (formerly Upstate Biotechnology).
Residue:424
BDBM50332042
NameBDBM50332042
Synonyms:CHEMBL1288931 | methyl 3-(2-(pyridin-4-yl)acetamido)thiophene-2-carboxylate
TypeSmall organic molecule
Emp. Form.C13H12N2O3S
Mol. Mass.276.311
SMILESCOC(=O)c1sccc1NC(=O)Cc1ccncc1