Reaction Details
TargetMitogen-activated protein kinase 9
LigandBDBM50332056
Substrate/Competitorn/a
Meas. Tech.ChEMBL_687740 (CHEMBL1291186)
IC50>50000±n/a nM
Citation Hom, RKBowers, SSealy, JMTruong, APProbst, GDNeitzel, MLNeitz, RJFang, LBrogley, LWu, JKonradi, AWSham, HLTóth, GPan, HYao, NArtis, DRQuinn, KSauer, JMPowell, KRen, ZBard, FYednock, TAGriswold-Prenner, I Design and synthesis of disubstituted thiophene and thiazole based inhibitors of JNK. Bioorg Med Chem Lett20:7303-7 (2010) 
 
Mitogen-activated protein kinase 9
Name:Mitogen-activated protein kinase 9
Type:Enzyme
Mol. Mass.:48131.49
Organism:Homo sapiens (Human)
Description:JNK-2 was purchased from Upstate Cell Signaling Solutions (formerly Upstate Biotechnology).
Residue:424
BDBM50332056
NameBDBM50332056
Synonyms:CHEMBL1288244 | N-(2-methoxyethyl)-3-(2-phenylacetamido)thiophene-2-carboxamide
TypeSmall organic molecule
Emp. Form.C16H18N2O3S
Mol. Mass.318.391
SMILESCOCCNC(=O)c1sccc1NC(=O)Cc1ccccc1