Reaction Details
TargetMitogen-activated protein kinase 9
LigandBDBM50332068
Substrate/Competitorn/a
Meas. Tech.ChEMBL_687740 (CHEMBL1291186)
IC50>50000±n/a nM
Citation Hom, RKBowers, SSealy, JMTruong, APProbst, GDNeitzel, MLNeitz, RJFang, LBrogley, LWu, JKonradi, AWSham, HLTóth, GPan, HYao, NArtis, DRQuinn, KSauer, JMPowell, KRen, ZBard, FYednock, TAGriswold-Prenner, I Design and synthesis of disubstituted thiophene and thiazole based inhibitors of JNK. Bioorg Med Chem Lett20:7303-7 (2010) 
 
Mitogen-activated protein kinase 9
Name:Mitogen-activated protein kinase 9
Type:Enzyme
Mol. Mass.:48131.49
Organism:Homo sapiens (Human)
Description:JNK-2 was purchased from Upstate Cell Signaling Solutions (formerly Upstate Biotechnology).
Residue:424
BDBM50332068
NameBDBM50332068
Synonyms:CHEMBL1287914 US9796706, Compound 84
TypeSmall organic molecule
Emp. Form.C19H15N3OS
Mol. Mass.333.407
SMILESO=C(Cc1cccc2ccccc12)Nc1ccsc1-n1ccnc1