Reaction Details
TargetMitogen-activated protein kinase 9
LigandBDBM50332075
Substrate/Competitorn/a
Meas. Tech.ChEMBL_687740 (CHEMBL1291186)
IC50 1500±n/a nM
Citation Hom, RKBowers, SSealy, JMTruong, APProbst, GDNeitzel, MLNeitz, RJFang, LBrogley, LWu, JKonradi, AWSham, HLTóth, GPan, HYao, NArtis, DRQuinn, KSauer, JMPowell, KRen, ZBard, FYednock, TAGriswold-Prenner, I Design and synthesis of disubstituted thiophene and thiazole based inhibitors of JNK. Bioorg Med Chem Lett20:7303-7 (2010) 
 
Mitogen-activated protein kinase 9
Name:Mitogen-activated protein kinase 9
Type:Enzyme
Mol. Mass.:48131.49
Organism:Homo sapiens (Human)
Description:JNK-2 was purchased from Upstate Cell Signaling Solutions (formerly Upstate Biotechnology).
Residue:424
BDBM50332075
NameBDBM50332075
Synonyms:CHEMBL1288004 US9796706, Compound 74
TypeSmall organic molecule
Emp. Form.C20H17N3OS
Mol. Mass.347.433
SMILESCc1cc(n[nH]1)-c1sccc1NC(=O)Cc1cccc2ccccc12