Reaction Details
TargetMitogen-activated protein kinase 9
LigandBDBM50332089
Substrate/Competitorn/a
Meas. Tech.ChEMBL_687740 (CHEMBL1291186)
IC50 7600±n/a nM
Citation Hom, RKBowers, SSealy, JMTruong, APProbst, GDNeitzel, MLNeitz, RJFang, LBrogley, LWu, JKonradi, AWSham, HLTóth, GPan, HYao, NArtis, DRQuinn, KSauer, JMPowell, KRen, ZBard, FYednock, TAGriswold-Prenner, I Design and synthesis of disubstituted thiophene and thiazole based inhibitors of JNK. Bioorg Med Chem Lett20:7303-7 (2010) 
 
Mitogen-activated protein kinase 9
Name:Mitogen-activated protein kinase 9
Type:Enzyme
Mol. Mass.:48131.49
Organism:Homo sapiens (Human)
Description:JNK-2 was purchased from Upstate Cell Signaling Solutions (formerly Upstate Biotechnology).
Residue:424
BDBM50332089
NameBDBM50332089
Synonyms:2-(isoquinolin-5-yl)-N-(4-(1-methyl-1H-1,2,4-triazol-5-yl)thiazol-5-yl)acetamide US9796706, Compound 68
TypeSmall organic molecule
Emp. Form.C17H14N6OS
Mol. Mass.350.398
SMILESCn1ncnc1-c1ncsc1NC(=O)Cc1cccc2cnccc12