Reaction Details
TargetMitogen-activated protein kinase 9
LigandBDBM50332090
Substrate/Competitorn/a
Meas. Tech.ChEMBL_687740 (CHEMBL1291186)
IC50 2000±n/a nM
Citation Hom, RKBowers, SSealy, JMTruong, APProbst, GDNeitzel, MLNeitz, RJFang, LBrogley, LWu, JKonradi, AWSham, HLTóth, GPan, HYao, NArtis, DRQuinn, KSauer, JMPowell, KRen, ZBard, FYednock, TAGriswold-Prenner, I Design and synthesis of disubstituted thiophene and thiazole based inhibitors of JNK. Bioorg Med Chem Lett20:7303-7 (2010) 
 
Mitogen-activated protein kinase 9
Name:Mitogen-activated protein kinase 9
Type:Enzyme
Mol. Mass.:48131.49
Organism:Homo sapiens (Human)
Description:JNK-2 was purchased from Upstate Cell Signaling Solutions (formerly Upstate Biotechnology).
Residue:424
BDBM50332090
NameBDBM50332090
Synonyms:2-(isoquinolin-5-yl)-N-(4-(pyrazin-2-yl)thiazol-5-yl)acetamide US9796706, Compound 86
TypeSmall organic molecule
Emp. Form.C18H13N5OS
Mol. Mass.347.394
SMILESO=C(Cc1cccc2cnccc12)Nc1scnc1-c1cnccn1