Reaction Details
TargetMitogen-activated protein kinase 10
LigandBDBM50332058
Substrate/Competitorn/a
Meas. Tech.ChEMBL_687741 (CHEMBL1291187)
IC50>50000±n/a nM
Citation Hom, RKBowers, SSealy, JMTruong, APProbst, GDNeitzel, MLNeitz, RJFang, LBrogley, LWu, JKonradi, AWSham, HLTóth, GPan, HYao, NArtis, DRQuinn, KSauer, JMPowell, KRen, ZBard, FYednock, TAGriswold-Prenner, I Design and synthesis of disubstituted thiophene and thiazole based inhibitors of JNK. Bioorg Med Chem Lett20:7303-7 (2010) 
 
Mitogen-activated protein kinase 10
Name:Mitogen-activated protein kinase 10
Type:Enzyme
Mol. Mass.:52586.89
Organism:Homo sapiens (Human)
Description:n/a
Residue:464
BDBM50332058
NameBDBM50332058
Synonyms:CHEMBL1288272 | methyl 4-(2-(naphthalen-1-yl)acetamido)-1,2,5-oxadiazole-3-carboxylate
TypeSmall organic molecule
Emp. Form.C16H13N3O4
Mol. Mass.311.2921
SMILESCOC(=O)c1nonc1NC(=O)Cc1cccc2ccccc12