Reaction Details
TargetMitogen-activated protein kinase 10
LigandBDBM50332063
Substrate/Competitorn/a
Meas. Tech.ChEMBL_687741 (CHEMBL1291187)
IC50 1700±n/a nM
Citation Hom, RKBowers, SSealy, JMTruong, APProbst, GDNeitzel, MLNeitz, RJFang, LBrogley, LWu, JKonradi, AWSham, HLTóth, GPan, HYao, NArtis, DRQuinn, KSauer, JMPowell, KRen, ZBard, FYednock, TAGriswold-Prenner, I Design and synthesis of disubstituted thiophene and thiazole based inhibitors of JNK. Bioorg Med Chem Lett20:7303-7 (2010) 
 
Mitogen-activated protein kinase 10
Name:Mitogen-activated protein kinase 10
Type:Enzyme
Mol. Mass.:52586.89
Organism:Homo sapiens (Human)
Description:n/a
Residue:464
BDBM50332063
NameBDBM50332063
Synonyms:CHEMBL1287858 | methyl 2-(2-(naphthalen-1-yl)acetamido)benzoate
TypeSmall organic molecule
Emp. Form.C20H17NO3
Mol. Mass.319.3539
SMILESCOC(=O)c1ccccc1NC(=O)Cc1cccc2ccccc12