Reaction Details
TargetMitogen-activated protein kinase 10
LigandBDBM50332095
Substrate/Competitorn/a
Meas. Tech.ChEMBL_687741 (CHEMBL1291187)
IC50 29000±n/a nM
Citation Hom, RKBowers, SSealy, JMTruong, APProbst, GDNeitzel, MLNeitz, RJFang, LBrogley, LWu, JKonradi, AWSham, HLTóth, GPan, HYao, NArtis, DRQuinn, KSauer, JMPowell, KRen, ZBard, FYednock, TAGriswold-Prenner, I Design and synthesis of disubstituted thiophene and thiazole based inhibitors of JNK. Bioorg Med Chem Lett20:7303-7 (2010) 
 
Mitogen-activated protein kinase 10
Name:Mitogen-activated protein kinase 10
Type:Enzyme
Mol. Mass.:52586.89
Organism:Homo sapiens (Human)
Description:n/a
Residue:464
BDBM50332095
NameBDBM50332095
Synonyms:CHEMBL1288964 | N-(2-(1-(hydroxyimino)ethyl)thiophen-3-yl)-2-phenylacetamide
TypeSmall organic molecule
Emp. Form.C14H14N2O2S
Mol. Mass.274.338
SMILESCC(N=O)c1sccc1NC(=O)Cc1ccccc1