Reaction Details
TargetMitogen-activated protein kinase 14
LigandBDBM50332088
Substrate/Competitorn/a
Meas. Tech.ChEMBL_687746 (CHEMBL1291192)
IC50>50000±n/a nM
Citation Hom, RKBowers, SSealy, JMTruong, APProbst, GDNeitzel, MLNeitz, RJFang, LBrogley, LWu, JKonradi, AWSham, HLTóth, GPan, HYao, NArtis, DRQuinn, KSauer, JMPowell, KRen, ZBard, FYednock, TAGriswold-Prenner, I Design and synthesis of disubstituted thiophene and thiazole based inhibitors of JNK. Bioorg Med Chem Lett20:7303-7 (2010) 
 
Mitogen-activated protein kinase 14
Name:Mitogen-activated protein kinase 14
Type:Serine/threonine-protein kinase
Mol. Mass.:41286.76
Organism:Homo sapiens (Human)
Description:Q16539
Residue:360
BDBM50332088
NameBDBM50332088
Synonyms:CHEMBL1288128 | N-(4-(1H-1,2,4-triazol-3-yl)thiazol-5-yl)-2-(isoquinolin-5-yl)acetamide
TypeSmall organic molecule
Emp. Form.C16H12N6OS
Mol. Mass.336.371
SMILESO=C(Cc1cccc2cnccc12)Nc1scnc1-c1nnc[nH]1