Reaction Details
TargetMitogen-activated protein kinase 14
LigandBDBM50332079
Substrate/Competitorn/a
Meas. Tech.ChEMBL_687746 (CHEMBL1291192)
IC50>50000±n/a nM
Citation Hom, RKBowers, SSealy, JMTruong, APProbst, GDNeitzel, MLNeitz, RJFang, LBrogley, LWu, JKonradi, AWSham, HLTóth, GPan, HYao, NArtis, DRQuinn, KSauer, JMPowell, KRen, ZBard, FYednock, TAGriswold-Prenner, I Design and synthesis of disubstituted thiophene and thiazole based inhibitors of JNK. Bioorg Med Chem Lett20:7303-7 (2010) 
 
Mitogen-activated protein kinase 14
Name:Mitogen-activated protein kinase 14
Type:Serine/threonine-protein kinase
Mol. Mass.:41286.76
Organism:Homo sapiens (Human)
Description:Q16539
Residue:360
BDBM50332079
NameBDBM50332079
Synonyms:2-(4-methoxyphenyl)-N-(2-(5-(trifluoromethyl)-1H-1,2,4-triazol-3-yl)thiophen-3-yl)acetamide | CHEMBL1288038
TypeSmall organic molecule
Emp. Form.C16H13F3N4O2S
Mol. Mass.382.36
SMILESCOc1ccc(CC(=O)Nc2ccsc2-c2nnc([nH]2)C(F)(F)F)cc1