Reaction Details
TargetMitogen-activated protein kinase 1
LigandBDBM50332090
Substrate/Competitorn/a
Meas. Tech.ChEMBL_687745 (CHEMBL1291191)
IC50>50000±n/a nM
Citation Hom, RKBowers, SSealy, JMTruong, APProbst, GDNeitzel, MLNeitz, RJFang, LBrogley, LWu, JKonradi, AWSham, HLTóth, GPan, HYao, NArtis, DRQuinn, KSauer, JMPowell, KRen, ZBard, FYednock, TAGriswold-Prenner, I Design and synthesis of disubstituted thiophene and thiazole based inhibitors of JNK. Bioorg Med Chem Lett20:7303-7 (2010) 
 
Mitogen-activated protein kinase 1
Name:Mitogen-activated protein kinase 1
Type:Ser/Thr Protein Kinase
Mol. Mass.:41392.76
Organism:Homo sapiens (Human)
Description:P28482
Residue:360
BDBM50332090
NameBDBM50332090
Synonyms:2-(isoquinolin-5-yl)-N-(4-(pyrazin-2-yl)thiazol-5-yl)acetamide US9796706, Compound 86
TypeSmall organic molecule
Emp. Form.C18H13N5OS
Mol. Mass.347.394
SMILESO=C(Cc1cccc2cnccc12)Nc1scnc1-c1cnccn1