Reaction Details
TargetPhospholipase C
LigandBDBM50332115
Substrate/Competitorn/a
Meas. Tech.ChEMBL_687789 (CHEMBL1291297)
Ki 2500±n/a nM
Citation González-Bulnes, PGonzález-Roura, ACanals, DDelgado, ACasas, JLlebaria, A 2-aminohydroxamic acid derivatives as inhibitors of Bacillus cereus phosphatidylcholine preferred phospholipase C PC-PLC(Bc). Bioorg Med Chem18:8549-55 (2010) 
 
Phospholipase C
Name:Phospholipase C
Type:PROTEIN
Mol. Mass.:32387.39
Organism:Bacillus cereus
Description:ChEMBL_687786
Residue:283
BDBM50332115
NameBDBM50332115
Synonyms:3-(N-(benzyloxy)-2-(tert-butyloxycarbonylamino)dodecanamido-N,N,N-trimethylpropan-1-aminium iodide | CHEMBL1287946
TypeSmall organic molecule
Emp. Form.C30H54N3O4
Mol. Mass.520.7669
SMILESCCCCCCCCCCC(NC(=O)OC(C)(C)C)C(=O)N(CCC[N+](C)(C)C)OCc1ccccc1