Reaction Details
TargetRibosyldihydronicotinamide dehydrogenase [quinone]
LigandBDBM23449
Substrate/Competitorn/a
Meas. Tech.ChEMBL_687953 (CHEMBL1291625)
IC50 3300±n/a nM
Citation Nolan, KACaraher, MCHumphries, MPBettley, HABryce, RAStratford, IJ In silico identification and biochemical evaluation of novel inhibitors of NRH:quinone oxidoreductase 2 (NQO2). Bioorg Med Chem Lett20:7331-6 (2010) 
 
Ribosyldihydronicotinamide dehydrogenase [quinone]
Name:Ribosyldihydronicotinamide dehydrogenase [quinone]
Type:Protein
Mol. Mass.:25917.25
Organism:Homo sapiens (Human)
Description:P16083
Residue:231
BDBM23449
NameBDBM23449
Synonyms:1,3-Dihydroxynaphthalene Naphthoresorcinol
TypeSmall organic molecule
Emp. Form.C10H8O2
Mol. Mass.160.1693
SMILESOc1cc(O)c2ccccc2c1