Reaction Details
TargetRibosyldihydronicotinamide dehydrogenase [quinone]
LigandBDBM50332192
Substrate/Competitorn/a
Meas. Tech.ChEMBL_687953 (CHEMBL1291625)
IC50 1800±n/a nM
Citation Nolan, KACaraher, MCHumphries, MPBettley, HABryce, RAStratford, IJ In silico identification and biochemical evaluation of novel inhibitors of NRH:quinone oxidoreductase 2 (NQO2). Bioorg Med Chem Lett20:7331-6 (2010) 
 
Ribosyldihydronicotinamide dehydrogenase [quinone]
Name:Ribosyldihydronicotinamide dehydrogenase [quinone]
Type:Protein
Mol. Mass.:25917.25
Organism:Homo sapiens (Human)
Description:P16083
Residue:231
BDBM50332192
NameBDBM50332192
Synonyms:1-(2-(1H-Indol-3-yl)vinyl)isoquinoline NSC-77833
TypeSmall organic molecule
Emp. Form.C19H14N2
Mol. Mass.270.3279
SMILESC(=C/c1nccc2ccccc12)\c1c[nH]c2ccccc12