Reaction Details
TargetNAD(P)H dehydrogenase [quinone] 1
LigandBDBM50332181
Substrate/Competitorn/a
Meas. Tech.ChEMBL_687952 (CHEMBL1291624)
IC50 40000±n/a nM
Citation Nolan, KACaraher, MCHumphries, MPBettley, HABryce, RAStratford, IJ In silico identification and biochemical evaluation of novel inhibitors of NRH:quinone oxidoreductase 2 (NQO2). Bioorg Med Chem Lett20:7331-6 (2010) 
 
NAD(P)H dehydrogenase [quinone] 1
Name:NAD(P)H dehydrogenase [quinone] 1
Type:Homodimer
Mol. Mass.:30874.82
Organism:Homo sapiens (Human)
Description:n/a
Residue:274
BDBM50332181
NameBDBM50332181
Synonyms:2-(4-Methoxyphenyl)-3-(3,4,5-trimethoxyphenyl)acrylonitrile NSC-332172
TypeSmall organic molecule
Emp. Form.C19H19NO4
Mol. Mass.325.3585
SMILESCOc1ccc(cc1)C(=C/c1cc(OC)c(OC)c(OC)c1)\C#N