Reaction Details
TargetCannabinoid receptor 1
LigandBDBM50332244
Substrate/Competitorn/a
Meas. Tech.ChEMBL_685959 (CHEMBL1292715)
IC50>10000±n/a nM
Citation Osman, NAMahmoud, AHAllarà, MNiess, RAbouzid, KADi Marzo, VAbadi, AH Synthesis, binding studies and molecular modeling of novel cannabinoid receptor ligands. Bioorg Med Chem18:8463-77 (2010) 
 
Cannabinoid receptor 1
Name:Cannabinoid receptor 1
Type:G Protein-Coupled Receptor (GPCR)
Mol. Mass.:52868.96
Organism:Homo sapiens (Human)
Description:P21554
Residue:472
BDBM50332244
NameBDBM50332244
Synonyms:(E)-6-(3,4-Dimethoxyphenyl)4-oxohex-5-enoic acid piperedinamide | CHEMBL1288088
TypeSmall organic molecule
Emp. Form.C19H25NO4
Mol. Mass.331.4061
SMILESCOc1ccc(C=CC(=O)CCC(=O)N2CCCCC2)cc1OC