Reaction Details
TargetCannabinoid receptor 1
LigandBDBM50332248
Substrate/Competitorn/a
Meas. Tech.ChEMBL_685959 (CHEMBL1292715)
Ki>10000±n/a nM
Citation Osman, NAMahmoud, AHAllarà, MNiess, RAbouzid, KADi Marzo, VAbadi, AH Synthesis, binding studies and molecular modeling of novel cannabinoid receptor ligands. Bioorg Med Chem18:8463-77 (2010) 
 
Cannabinoid receptor 1
Name:Cannabinoid receptor 1
Type:G Protein-Coupled Receptor (GPCR)
Mol. Mass.:52868.96
Organism:Homo sapiens (Human)
Description:P21554
Residue:472
BDBM50332248
NameBDBM50332248
Synonyms:(E)-6-Naphthalen-2-yl-4-oxohex-5-enoic acid ethanolamide | CHEMBL1288120
TypeSmall organic molecule
Emp. Form.C18H19NO3
Mol. Mass.297.3484
SMILESOCCNC(=O)CCC(=O)C=Cc1ccc2ccccc2c1