Reaction Details
TargetCannabinoid receptor 1
LigandBDBM50332261
Substrate/Competitorn/a
Meas. Tech.ChEMBL_685959 (CHEMBL1292715)
Ki>10000±n/a nM
Citation Osman, NAMahmoud, AHAllarà, MNiess, RAbouzid, KADi Marzo, VAbadi, AH Synthesis, binding studies and molecular modeling of novel cannabinoid receptor ligands. Bioorg Med Chem18:8463-77 (2010) 
 
Cannabinoid receptor 1
Name:Cannabinoid receptor 1
Type:G Protein-Coupled Receptor (GPCR)
Mol. Mass.:52868.96
Organism:Homo sapiens (Human)
Description:P21554
Residue:472
BDBM50332261
NameBDBM50332261
Synonyms:1-Biphenyl-4-yl-4-morpholin-4-yl-butane-1,4-dione | CHEMBL1288265
TypeSmall organic molecule
Emp. Form.C20H21NO3
Mol. Mass.323.3856
SMILESO=C(CCC(=O)c1ccc(cc1)-c1ccccc1)N1CCOCC1