Reaction Details
TargetCannabinoid receptor 2
LigandBDBM50332253
Substrate/Competitorn/a
Meas. Tech.ChEMBL_685961 (CHEMBL1292717)
Ki>10000±n/a nM
Citation Osman, NAMahmoud, AHAllarà, MNiess, RAbouzid, KADi Marzo, VAbadi, AH Synthesis, binding studies and molecular modeling of novel cannabinoid receptor ligands. Bioorg Med Chem18:8463-77 (2010) 
 
Cannabinoid receptor 2
Name:Cannabinoid receptor 2
Type:G Protein-Coupled Receptor (GPCR)
Mol. Mass.:39690.94
Organism:Homo sapiens (Human)
Description:P34972
Residue:360
BDBM50332253
NameBDBM50332253
Synonyms:(E)-6-Naphthalen-2-yl-4-oxohex-5-enoic acid(2-hydroxy-1(R)-methylethanolamide | CHEMBL1288180
TypeSmall organic molecule
Emp. Form.C19H21NO3
Mol. Mass.311.3749
SMILESC[C@H](CO)NC(=O)CCC(=O)C=Cc1ccc2ccccc2c1