Reaction Details
TargetCannabinoid receptor 2
LigandBDBM50332254
Substrate/Competitorn/a
Meas. Tech.ChEMBL_685961 (CHEMBL1292717)
Ki>10000±n/a nM
Citation Osman, NAMahmoud, AHAllarà, MNiess, RAbouzid, KADi Marzo, VAbadi, AH Synthesis, binding studies and molecular modeling of novel cannabinoid receptor ligands. Bioorg Med Chem18:8463-77 (2010) 
 
Cannabinoid receptor 2
Name:Cannabinoid receptor 2
Type:G Protein-Coupled Receptor (GPCR)
Mol. Mass.:39690.94
Organism:Homo sapiens (Human)
Description:P34972
Residue:360
BDBM50332254
NameBDBM50332254
Synonyms:(E)-7-Naphthalen-2-yl-5-oxohept-6-enoic piperidinamide | CHEMBL1288181
TypeSmall organic molecule
Emp. Form.C22H25NO2
Mol. Mass.335.4394
SMILESO=C(CCCC(=O)N1CCCCC1)C=Cc1ccc2ccccc2c1