Reaction Details
TargetCannabinoid receptor 2
LigandBDBM50332256
Substrate/Competitorn/a
Meas. Tech.ChEMBL_685961 (CHEMBL1292717)
Ki 2040±n/a nM
Citation Osman, NAMahmoud, AHAllarà, MNiess, RAbouzid, KADi Marzo, VAbadi, AH Synthesis, binding studies and molecular modeling of novel cannabinoid receptor ligands. Bioorg Med Chem18:8463-77 (2010) 
 
Cannabinoid receptor 2
Name:Cannabinoid receptor 2
Type:G Protein-Coupled Receptor (GPCR)
Mol. Mass.:39690.94
Organism:Homo sapiens (Human)
Description:P34972
Residue:360
BDBM50332256
NameBDBM50332256
Synonyms:(E)-7-Naphthalen-2-yl-5-oxohept-6-enoic acid cyclopropylamide | CHEMBL1288209
TypeSmall organic molecule
Emp. Form.C20H21NO2
Mol. Mass.307.3862
SMILESO=C(CCCC(=O)C=Cc1ccc2ccccc2c1)NC1CC1