Reaction Details
TargetDisintegrin and metalloproteinase domain-containing protein 17
LigandBDBM50332279
Substrate/Competitorn/a
Meas. Tech.ChEMBL_686062 (CHEMBL1292818)
Ki 0.190000±n/a nM
Citation Girijavallabhan, VMChen, LDai, CFeltz, RJFirmansjah, LLi, DKim, SHKozlowski, JALavey, BJKosinski, APiwinski, JJPopovici-Muller, JRizvi, RRosner, KEShankar, BBShih, NYSiddiqui, MATong, LWong, MKYang, DYYang, LYu, WZhou, GGuo, ZOrth, PMadison, VBian, HLundell, DNiu, XShah, HSun, JUmland, S Novel TNF-a converting enzyme (TACE) inhibitors as potential treatment for inflammatory diseases. Bioorg Med Chem Lett20:7283-7 (2010) 
 
Disintegrin and metalloproteinase domain-containing protein 17
Name:Disintegrin and metalloproteinase domain-containing protein 17
Type:Enzyme
Mol. Mass.:93007.89
Organism:Homo sapiens (Human)
Description:
Residue:824
BDBM50332279
NameBDBM50332279
Synonyms:(R)-5-((1H-indol-6-yl)ethynyl)-5-((6-methoxy-1-oxoisoindolin-2-yl)methyl)imidazolidine-2,4-dione | CHEMBL1288267
TypeSmall organic molecule
Emp. Form.C23H18N4O4
Mol. Mass.414.4134
SMILESCOc1ccc2CN(C[C@]3(NC(=O)NC3=O)C#Cc3ccc4cc[nH]c4c3)C(=O)c2c1