Reaction Details
TargetDisintegrin and metalloproteinase domain-containing protein 17
LigandBDBM102773
Substrate/Competitorn/a
Meas. Tech.ChEMBL_686062 (CHEMBL1292818)
Ki 0.610000±n/a nM
Citation Girijavallabhan, VMChen, LDai, CFeltz, RJFirmansjah, LLi, DKim, SHKozlowski, JALavey, BJKosinski, APiwinski, JJPopovici-Muller, JRizvi, RRosner, KEShankar, BBShih, NYSiddiqui, MATong, LWong, MKYang, DYYang, LYu, WZhou, GGuo, ZOrth, PMadison, VBian, HLundell, DNiu, XShah, HSun, JUmland, S Novel TNF-a converting enzyme (TACE) inhibitors as potential treatment for inflammatory diseases. Bioorg Med Chem Lett20:7283-7 (2010) 
 
Disintegrin and metalloproteinase domain-containing protein 17
Name:Disintegrin and metalloproteinase domain-containing protein 17
Type:Enzyme
Mol. Mass.:93007.89
Organism:Homo sapiens (Human)
Description:
Residue:824
BDBM102773
NameBDBM102773
Synonyms:CHEMBL1287882 | US8541572, 2203
TypeSmall organic molecule
Emp. Form.C25H25N5O4
Mol. Mass.459.4971
SMILESCOc1ccc2CN(C[C@]3(NC(=O)NC3=O)C#Cc3ccc(cc3)N3CCNCC3)C(=O)c2c1