Reaction Details
TargetGamma-aminobutyric acid receptor subunit alpha-1/beta-2/gamma-2
LigandBDBM50065229
Substrate/Competitorn/a
Meas. Tech.ChEMBL_696701 (CHEMBL1638613)
EC50 9±n/a nM
Citation Liu, XFChang, HFSchmiesing, RJWesolowski, SSKnappenberger, KSArriza, JLChapdelaine, MJ Developing dual functional allosteric modulators of GABA(A) receptors. Bioorg Med Chem18:8374-82 (2010) 
 
Gamma-aminobutyric acid receptor subunit alpha-1/beta-2/gamma-2
Name:Gamma-aminobutyric acid receptor subunit alpha-1/beta-2/gamma-2
Type:Protein
Mol. Mass.:n/a
Description:n/a
Components:This complex has 3 components.
Component 1
Name:Gamma-aminobutyric acid receptor subunit alpha-1
Synonyms:Benzodiazepine central GABA A Benzodiazepine liver GABA(A) receptor subunit alpha-1 GABA-A receptor GBRA1_HUMAN TBPS | agonist GABA site
Type:Protein
Mol. Mass.:51817.35
Organism:Homo sapiens (Human)
Description:P14867
Residue:456
Component 2
Name:Gamma-aminobutyric acid receptor subunit beta-2
Synonyms:GABA(A) receptor subunit beta-2 GBRB2_HUMAN
Type:PROTEIN
Mol. Mass.:59167.91
Organism:Homo sapiens (Human)
Description:EBI_221
Residue:512
Component 3
Name:Gamma-aminobutyric acid receptor subunit gamma-2
Synonyms:GABA(A) receptor subunit gamma-2 GBRG2_HUMAN
Type:PROTEIN
Mol. Mass.:54172.74
Organism:Homo sapiens (Human)
Description:EBI_217
Residue:467
BDBM50065229
NameBDBM50065229
Synonyms:4-Ethyl-6,7-dimethoxy-9H-beta-carboline-3-carboxylic acid methyl ester 4-Ethyl-6,7-dimethoxy-9H-carbazole-3-carboxylic acid methyl ester | CHEMBL17468
TypeSmall organic molecule
Emp. Form.C17H18N2O4
Mol. Mass.314.3358
SMILESCCc1c([nH]cc2nc3cc(OC)c(OC)cc3c12)C(=O)OC