Reaction Details
TargetDisintegrin and metalloproteinase domain-containing protein 17
LigandBDBM50332470
Substrate/Competitorn/a
Meas. Tech.ChEMBL_697248 (CHEMBL1640792)
IC50 0.300000±n/a nM
Citation Yang, JSChun, KPark, JECho, MSeo, JSong, DYoon, HPark, CHJoe, BYChoi, JHKim, MHHan, G Structure based optimization of chromen-based TNF-a converting enzyme (TACE) inhibitors on S1' pocket and their quantitative structure-activity relationship (QSAR) study. Bioorg Med Chem18:8618-29 (2010) 
 
Disintegrin and metalloproteinase domain-containing protein 17
Name:Disintegrin and metalloproteinase domain-containing protein 17
Type:Enzyme
Mol. Mass.:93007.89
Organism:Homo sapiens (Human)
Description:
Residue:824
BDBM50332470
NameBDBM50332470
Synonyms:CHEMBL1630100 | N-Hydroxy-4-(4-hydroxyphenyl)-2-((6-methyl-2-oxo-2H-chromen-3-yl)methyl)butan-amide
TypeSmall organic molecule
Emp. Form.C21H21NO5
Mol. Mass.367.3951
SMILESCc1ccc2oc(=O)c(CC(CCc3ccc(O)cc3)C(=O)NO)cc2c1