Reaction Details
TargetDisintegrin and metalloproteinase domain-containing protein 17
LigandBDBM50332471
Substrate/Competitorn/a
Meas. Tech.ChEMBL_697248 (CHEMBL1640792)
IC50 11±n/a nM
Citation Yang, JSChun, KPark, JECho, MSeo, JSong, DYoon, HPark, CHJoe, BYChoi, JHKim, MHHan, G Structure based optimization of chromen-based TNF-a converting enzyme (TACE) inhibitors on S1' pocket and their quantitative structure-activity relationship (QSAR) study. Bioorg Med Chem18:8618-29 (2010) 
 
Disintegrin and metalloproteinase domain-containing protein 17
Name:Disintegrin and metalloproteinase domain-containing protein 17
Type:Enzyme
Mol. Mass.:93007.89
Organism:Homo sapiens (Human)
Description:
Residue:824
BDBM50332471
NameBDBM50332471
Synonyms:3-(6-Methyl-2-oxo-2H-chromen-3-yl)-2-(4-(2-(piperidin-1-yl)ethoxy)benzyl)propanoic acid hydroxyamide | CHEMBL1630101
TypeSmall organic molecule
Emp. Form.C27H32N2O5
Mol. Mass.464.5534
SMILESCc1ccc2oc(=O)c(CC(Cc3ccc(OCCN4CCCCC4)cc3)C(=O)NO)cc2c1