Reaction Details
TargetDisintegrin and metalloproteinase domain-containing protein 17
LigandBDBM50332482
Substrate/Competitorn/a
Meas. Tech.ChEMBL_697248 (CHEMBL1640792)
IC50 33±n/a nM
Citation Yang, JSChun, KPark, JECho, MSeo, JSong, DYoon, HPark, CHJoe, BYChoi, JHKim, MHHan, G Structure based optimization of chromen-based TNF-a converting enzyme (TACE) inhibitors on S1' pocket and their quantitative structure-activity relationship (QSAR) study. Bioorg Med Chem18:8618-29 (2010) 
 
Disintegrin and metalloproteinase domain-containing protein 17
Name:Disintegrin and metalloproteinase domain-containing protein 17
Type:Enzyme
Mol. Mass.:93007.89
Organism:Homo sapiens (Human)
Description:
Residue:824
BDBM50332482
NameBDBM50332482
Synonyms:2-((6-Methyl-2-oxo-2H-chromen-3-yl)methyl)-6-phenylhexanoicacid hydroxyamide | CHEMBL1630099
TypeSmall organic molecule
Emp. Form.C23H25NO4
Mol. Mass.379.4489
SMILESCc1ccc2oc(=O)c(CC(CCCCc3ccccc3)C(=O)NO)cc2c1