Reaction Details
TargetHistone deacetylase 8
LigandBDBM50332486
Substrate/Competitorn/a
Meas. Tech.ChEMBL_695076 (CHEMBL1640693)
IC50>32000±n/a nM
Citation Mahboobi, SSellmer, AWinkler, MEichhorn, EPongratz, HCiossek, TBaer, TMaier, TBeckers, T Novel chimeric histone deacetylase inhibitors: a series of lapatinib hybrides as potent inhibitors of epidermal growth factor receptor (EGFR), human epidermal growth factor receptor 2 (HER2), and histone deacetylase activity. J Med Chem53:8546-55 (2010) 
 
Histone deacetylase 8
Name:Histone deacetylase 8
Type:Enzyme
Mol. Mass.:41749.60
Organism:Homo sapiens (Human)
Description:Q9BY41
Residue:377
BDBM50332486
NameBDBM50332486
Synonyms:CHEMBL1630113 | N-(2-aminophenyl)-3-(5-(4-(3-chloro-4-(3-fluorobenzyloxy)phenylamino)quinazolin-6-yl)furan-2-yl)acrylamide
TypeSmall organic molecule
Emp. Form.C34H25ClFN5O3
Mol. Mass.606.045
SMILESNc1ccccc1NC(=O)\C=C\c1ccc(o1)-c1ccc2ncnc(Nc3ccc(OCc4cccc(F)c4)c(Cl)c3)c2c1