Reaction Details
TargetHistone deacetylase 1
LigandBDBM50332493
Substrate/Competitorn/a
Meas. Tech.ChEMBL_695073 (CHEMBL1640690)
IC50 940±n/a nM
Citation Mahboobi, SSellmer, AWinkler, MEichhorn, EPongratz, HCiossek, TBaer, TMaier, TBeckers, T Novel chimeric histone deacetylase inhibitors: a series of lapatinib hybrides as potent inhibitors of epidermal growth factor receptor (EGFR), human epidermal growth factor receptor 2 (HER2), and histone deacetylase activity. J Med Chem53:8546-55 (2010) 
 
Histone deacetylase 1
Name:Histone deacetylase 1
Type:Enzyme
Mol. Mass.:55090.27
Organism:Homo sapiens (Human)
Description:Q13547
Residue:482
BDBM50332493
NameBDBM50332493
Synonyms:5-(4-(3-chloro-4-(3-fluorobenzyloxy)phenylamino)quinazolin-6-yl)-N-hydroxythiophene-2-carboxamide | CHEMBL1630118
TypeSmall organic molecule
Emp. Form.C26H18ClFN4O3S
Mol. Mass.520.963
SMILESONC(=O)c1ccc(s1)-c1ccc2ncnc(Nc3ccc(OCc4cccc(F)c4)c(Cl)c3)c2c1