Reaction Details
TargetReceptor tyrosine-protein kinase erbB-2
LigandBDBM50332489
Substrate/Competitorn/a
Meas. Tech.ChEMBL_695078 (CHEMBL1640695)
IC50 4.7±n/a nM
Citation Mahboobi, SSellmer, AWinkler, MEichhorn, EPongratz, HCiossek, TBaer, TMaier, TBeckers, T Novel chimeric histone deacetylase inhibitors: a series of lapatinib hybrides as potent inhibitors of epidermal growth factor receptor (EGFR), human epidermal growth factor receptor 2 (HER2), and histone deacetylase activity. J Med Chem53:8546-55 (2010) 
 
Receptor tyrosine-protein kinase erbB-2
Name:Receptor tyrosine-protein kinase erbB-2
Type:n/a
Mol. Mass.:137894.47
Organism:Homo sapiens (Human)
Description:P04626
Residue:1255
BDBM50332489
NameBDBM50332489
Synonyms:CHEMBL1630116 | N-(2-aminophenyl)-3-(4-(4-(3-chloro-4-(3-fluorobenzyloxy)phenylamino)quinazolin-6-yl)phenyl)propanamide
TypeSmall organic molecule
Emp. Form.C36H29ClFN5O2
Mol. Mass.618.099
SMILESNc1ccccc1NC(=O)CCc1ccc(cc1)-c1ccc2ncnc(Nc3ccc(OCc4cccc(F)c4)c(Cl)c3)c2c1