Reaction Details
TargetPlatelet-derived growth factor receptor beta
LigandBDBM50332488
Substrate/Competitorn/a
Meas. Tech.ChEMBL_695079 (CHEMBL1640696)
IC50 2700±n/a nM
Citation Mahboobi, SSellmer, AWinkler, MEichhorn, EPongratz, HCiossek, TBaer, TMaier, TBeckers, T Novel chimeric histone deacetylase inhibitors: a series of lapatinib hybrides as potent inhibitors of epidermal growth factor receptor (EGFR), human epidermal growth factor receptor 2 (HER2), and histone deacetylase activity. J Med Chem53:8546-55 (2010) 
 
Platelet-derived growth factor receptor beta
Name:Platelet-derived growth factor receptor beta
Type:Enzyme
Mol. Mass.:123922.25
Organism:Homo sapiens (Human)
Description:P09619
Residue:1106
BDBM50332488
NameBDBM50332488
Synonyms:(E)-N-(2-aminophenyl)-3-(4-(4-(3-chloro-4-(3-fluorobenzyloxy)phenylamino)quinazolin-6-yl)phenyl)acrylamide | CHEMBL1630115
TypeSmall organic molecule
Emp. Form.C36H27ClFN5O2
Mol. Mass.616.083
SMILESNc1ccccc1NC(=O)\C=C\c1ccc(cc1)-c1ccc2ncnc(Nc3ccc(OCc4cccc(F)c4)c(Cl)c3)c2c1