Reaction Details
TargetCyclin-dependent kinase 2
LigandBDBM50332491
Substrate/Competitorn/a
Meas. Tech.ChEMBL_695082 (CHEMBL1640699)
IC50 440±n/a nM
Citation Mahboobi, SSellmer, AWinkler, MEichhorn, EPongratz, HCiossek, TBaer, TMaier, TBeckers, T Novel chimeric histone deacetylase inhibitors: a series of lapatinib hybrides as potent inhibitors of epidermal growth factor receptor (EGFR), human epidermal growth factor receptor 2 (HER2), and histone deacetylase activity. J Med Chem53:8546-55 (2010) 
 
Cyclin-dependent kinase 2
Name:Cyclin-dependent kinase 2
Type:Enzyme Subunit
Mol. Mass.:33938.17
Organism:Homo sapiens (Human)
Description:P24941
Residue:298
BDBM50332491
NameBDBM50332491
Synonyms:(E)-3-(5-(4-(3-chloro-4-(3-fluorobenzyloxy)phenylamino)quinazolin-6-yl)thiophen-2-yl)-N-hydroxyacrylamide | CHEMBL1630108
TypeSmall organic molecule
Emp. Form.C28H20ClFN4O3S
Mol. Mass.547
SMILESONC(=O)\C=C\c1ccc(s1)-c1ccc2ncnc(Nc3ccc(OCc4cccc(F)c4)c(Cl)c3)c2c1